發病日,個案研判日,通報日,性別,年齡層,居住縣市,居住鄉鎮,居住村里,最小統計區,最小統計區中心點X,最小統計區中心點Y,一級統計區,二級統計區,感染縣市,感染鄉鎮,感染村里,是否境外移入,感染國家,確定病例數
2015/09/17,2015/09/23,2015/09/22,女,30-34,台南市,南區,建南里,A6733-0388-00,120.18588,22.97180,A6733-19-006,A6733-19,,,,否,,1
2014/10/06,2014/10/13,2014/10/12,男,65-69,高雄市,前鎮區,瑞華里,A6409-0171-00,120.33352,22.60961,A6409-24-003,A6409-24,高雄市,前鎮區,瑞華里,否,中華民國,1
2014/10/06,2014/10/13,2014/10/12,男,45-49,高雄市,三民區,灣勝里,A6405-0440-00,120.31441,22.65215,A6405-38-006,A6405-38,高雄市,三民區,灣勝里,否,中華民國,1
2014/10/06,2014/10/14,2014/10/13,男,25-29,高雄市,新興區,黎明里,A6406-0087-00,120.30394,22.63311,A6406-10-003,A6406-10,高雄市,新興區,黎明里,否,中華民國,1
2014/10/06,2014/10/14,2014/10/13,女,45-49,高雄市,左營區,菜公里,A6405-0896-00,120.30457,22.64451,A6405-72-009,A6405-72,高雄市,左營區,菜公里,否,中華民國,1
2014/10/06,2014/10/14,2014/10/13,女,45-49,高雄市,前鎮區,鎮陽里,A6409-0510-00,120.30956,22.59004,A6409-64-005,A6409-64,高雄市,前鎮區,鎮陽里,否,中華民國,1
2014/10/06,2014/10/17,2014/10/15,男,45-49,高雄市,鳳山區,二甲里,A6412-1355-00,120.33894,22.59963,A6412-C6-767,A6412-C6,高雄市,鳳山區,二甲里,否,中華民國,1
2014/10/06,2014/10/17,2014/10/16,女,55-59,高雄市,鳳山區,南成里,A6412-1729-00,120.33746,22.58928,A6412-E4-965,A6412-E4,高雄市,鳳山區,南成里,否,中華民國,1
2014/10/06,2014/10/07,2014/10/06,男,15-19,高雄市,三民區,安泰里,A6405-0655-00,120.32489,22.64823,A6405-62-002,A6405-62,高雄市,三民區,安泰里,否,中華民國,1
2014/10/06,2014/10/08,2014/10/07,女,35-39,高雄市,鳳山區,埤頂里,A6412-0368-00,120.37957,22.63192,A6412-29-210,A6412-29,高雄市,鳳山區,埤頂里,否,中華民國,1
2014/10/06,2014/10/09,2014/10/06,男,55-59,高雄市,三民區,本館里,A6405-0279-00,120.33100,22.65865,A6405-27-003,A6405-27,高雄市,三民區,本館里,否,中華民國,1
2015/09/18,2015/09/29,2015/09/25,男,35-39,台南市,安南區,溪北里,,,,,,台南市,永康區,大橋里,否,中華民國,1
2015/09/18,2015/09/20,2015/09/19,女,70+,台南市,南區,光明里,,,,,,台南市,南區,光明里,否,中華民國,1
2015/09/18,2015/09/21,2015/09/19,男,25-29,台南市,永康區,鹽行里,,,,,,台南市,永康區,鹽行里,否,中華民國,1
2015/09/19,2015/09/21,2015/09/21,男,10-14,台南市,北區,重興里,,,,,,台南市,北區,重興里,否,中華民國,1
2015/09/19,2015/09/21,2015/09/20,女,40-44,台南市,北區,賢北里,A6734-0449-00,120.22720,23.00840,A6734-25-008,A6734-25,台南市,北區,賢北里,否,中華民國,1
2015/09/19,2015/09/21,2015/09/20,女,65-69,台南市,北區,大山里,A6734-0321-00,120.22371,23.01112,A6734-19-003,A6734-19,台南市,北區,大山里,否,中華民國,1
2015/09/19,2015/09/21,2015/09/20,男,70+,台南市,永康區,五王里,A6731-0598-00,120.23285,23.01247,A6731-51-001,A6731-51,台南市,永康區,五王里,否,中華民國,1
2015/09/19,2015/09/21,2015/09/20,男,70+,台南市,南區,明興里,A6733-0594-00,120.19107,22.96339,A6733-30-006,A6733-30,台南市,南區,明興里,否,中華民國,1
2015/09/19,2015/09/21,2015/09/20,女,40-44,台南市,南區,廣州里,A6733-0088-00,120.19387,22.98240,A6733-05-005,A6733-05,台南市,南區,廣州里,否,中華民國,1
2015/09/19,2015/09/21,2015/09/19,女,50-54,高雄市,苓雅區,普天里,A6408-0407-00,120.31661,22.62056,A6408-45-006,A6408-45,高雄市,苓雅區,普天里,否,中華民國,1
2015/09/19,2015/09/21,2015/09/20,女,15-19,高雄市,三民區,裕民里,A6405-1362-00,120.30039,22.63823,A6405-C8-001,A6405-C8,高雄市,三民區,裕民里,否,中華民國,1
2015/09/19,2015/09/21,2015/09/21,女,40-44,高雄市,楠梓區,五常里,A6404-0306-00,120.33253,22.72831,A6404-33-004,A6404-33,,,,是,,1
2015/09/19,2015/09/21,2015/09/21,女,25-29,台南市,南區,國宅里,A6733-0234-00,120.19086,22.97742,A6733-08-009,A6733-08,台南市,南區,國宅里,否,中華民國,1
2015/09/19,2015/09/21,2015/09/21,男,55-59,台南市,東區,崇誨里,A6732-0197-00,120.22568,22.99023,A6732-09-008,A6732-09,台南市,東區,崇誨里,否,中華民國,1
2015/09/19,2015/09/21,2015/09/21,男,60-64,台南市,東區,新東里,A6732-0321-00,120.22692,22.98734,A6732-18-010,A6732-18,台南市,東區,新東里,否,中華民國,1
2015/09/19,2015/09/21,2015/09/21,女,55-59,台南市,仁德區,上崙里,A6727-0258-00,120.25872,22.94362,A6727-17-005,A6727-17,台南市,仁德區,上崙里,否,中華民國,1
2015/09/19,2015/09/21,2015/09/21,男,10-14,台南市,東區,東安里,A6732-0353-00,120.21964,22.98677,A6732-20-006,A6732-20,台南市,東區,東安里,否,中華民國,1
2015/09/19,2015/09/21,2015/09/21,男,60-64,台南市,中西區,大涼里,A6737-0325-00,120.19217,22.99204,A6737-15-010,A6737-15,台南市,中西區,大涼里,否,中華民國,1
2015/09/19,2015/09/24,2015/09/24,女,35-39,台南市,白河區,廣安里,A6703-0034-00,120.39104,23.39332,A6703-02-007,A6703-02,,,,否,,1
2015/09/19,2015/09/21,2015/09/21,男,70+,台南市,安平區,育平里,A6736-0311-00,120.16779,22.98949,A6736-17-003,A6736-17,台南市,安平區,育平里,否,中華民國,1
2015/09/19,2015/09/21,2015/09/21,男,55-59,台南市,南區,再興里,A6733-0216-00,120.19150,22.97807,A6733-10-007,A6733-10,台南市,南區,再興里,否,中華民國,1
2015/09/19,2015/09/21,2015/09/21,女,45-49,台南市,安平區,國平里,A6736-0284-00,120.16958,22.99099,A6736-18-001,A6736-18,台南市,安平區,國平里,否,中華民國,1
2015/09/19,2015/09/21,2015/09/21,女,70+,台南市,中西區,青年里,A6737-0301-00,120.20634,22.99305,A6737-14-007,A6737-14,台南市,中西區,青年里,否,中華民國,1
2015/09/19,2015/09/21,2015/09/21,女,10-14,台南市,南區,新興里,A6733-0160-00,120.19464,22.97985,A6733-07-006,A6733-07,台南市,南區,再興里,否,中華民國,1
2015/09/19,2015/09/21,2015/09/21,男,70+,台南市,北區,興南里,A6734-0595-00,120.21006,23.00537,A6734-40-006,A6734-40,台南市,北區,興南里,否,中華民國,1
2015/09/19,2015/09/21,2015/09/21,男,25-29,台南市,永康區,安康里,A6731-0489-00,120.22867,23.01607,A6731-38-005,A6731-38,台南市,永康區,安康里,否,中華民國,1
2015/09/19,2015/09/21,2015/09/21,女,70+,台南市,中西區,大南里,A6737-0464-00,120.20347,22.98550,A6737-25-006,A6737-25,台南市,中西區,大南里,否,中華民國,1
2015/09/19,2015/09/21,2015/09/21,男,65-69,台南市,北區,新勝里,A6734-0412-00,120.22171,23.00919,A6734-21-009,A6734-21,台南市,北區,新勝里,否,中華民國,1
2015/09/19,2015/09/21,2015/09/21,女,40-44,台南市,東區,東門里,A6732-0252-00,120.21342,22.98902,A6732-10-008,A6732-10,,,,否,,1
2015/09/19,2015/09/21,2015/09/21,女,60-64,台南市,南區,明興里,A6733-0584-00,120.19044,22.96400,A6733-30-004,A6733-30,,,,否,,1
2015/09/19,2015/09/21,2015/09/21,女,45-49,台南市,南區,國宅里,A6733-0304-00,120.18817,22.97526,A6733-13-005,A6733-13,,,,否,,1
2015/09/19,2015/09/21,2015/09/21,女,20-24,高雄市,三民區,灣成里,A6405-0313-00,120.32231,22.65696,A6405-28-008,A6405-28,高雄市,三民區,灣成里,否,中華民國,1
2015/09/19,2015/09/21,2015/09/21,男,15-19,高雄市,前鎮區,瑞祥里,A6409-0414-00,120.32707,22.60175,A6409-56-002,A6409-56,高雄市,前鎮區,瑞祥里,否,中華民國,1
2015/09/19,2015/09/21,2015/09/21,女,25-29,高雄市,苓雅區,正仁里,A6408-0133-00,120.33845,22.63088,A6408-09-008,A6408-09,高雄市,苓雅區,正仁里,否,中華民國,1
2015/09/19,2015/09/21,2015/09/21,男,20-24,台南市,北區,正覺里,A6735-0114-00,120.15942,23.07141,A6735-03-004,A6735-03,台南市,安南區,,否,中華民國,1
2015/09/19,2015/09/21,2015/09/19,女,10-14,台南市,安平區,平通里,A6736-0282-00,120.16580,22.99133,A6736-14-003,A6736-14,台南市,安平區,平通里,否,中華民國,1
2015/09/19,2015/09/21,2015/09/20,男,50-54,台南市,南區,文南里,A6733-0060-00,120.19052,22.98367,A6733-04-004,A6733-04,台南市,南區,文南里,否,中華民國,1
2015/09/19,2015/09/22,2015/09/21,男,60-64,台南市,南區,永寧里,,,,,,,,,否,,1
2015/09/19,2015/09/22,2015/09/22,女,30-34,台南市,北區,裕民里,,,,,,,,,否,,1
2015/09/19,2015/09/22,2015/09/22,女,70+,高雄市,前金區,北金里,A6407-0012-00,120.29376,22.63379,A6407-02-003,A6407-02,高雄市,前金區,北金里,否,中華民國,1
2015/09/19,2015/09/22,2015/09/22,男,70+,高雄市,鼓山區,山下里,A6402-0538-00,120.27994,22.62958,A6402-50-005,A6402-50,高雄市,鼓山區,山下里,否,中華民國,1
2015/09/19,2015/09/22,2015/09/22,女,65-69,高雄市,前金區,長興里,A6407-0044-00,120.29822,22.63121,A6407-05-006,A6407-05,高雄市,前金區,長興里,否,中華民國,1
2015/09/19,2015/09/22,2015/09/22,男,50-54,彰化縣,社頭鄉,協和村,A0717-0005-00,120.60386,23.93256,A0717-01-002,A0717-01,,,,是,緬甸,1
2014/10/06,2014/10/11,2014/10/10,女,60-64,高雄市,三民區,安生里,A6405-0867-00,120.34370,22.64519,A6405-83-004,A6405-83,高雄市,三民區,安生里,否,中華民國,1
2014/10/06,2014/10/11,2014/10/10,男,35-39,高雄市,鼓山區,明誠里,A6402-0169-00,120.30131,22.66346,A6402-17-007,A6402-17,高雄市,鼓山區,明誠里,否,中華民國,1
2014/10/06,2014/10/12,2014/10/11,女,50-54,高雄市,小港區,桂林里,A6411-0046-00,120.35149,22.58289,A6411-04-008,A6411-04,高雄市,小港區,桂林里,否,中華民國,1
2014/10/06,2014/10/12,2014/10/11,女,70+,高雄市,前鎮區,忠孝里,A6409-0012-00,120.31231,22.61578,A6409-02-003,A6409-02,高雄市,前鎮區,忠孝里,否,中華民國,1
2015/09/18,2015/09/23,2015/09/21,男,10-14,台南市,南區,開南里,,,,,,,,,否,,1
2014/10/06,2014/10/12,2014/10/11,男,35-39,高雄市,三民區,同德里,A6405-0984-00,120.33257,22.64331,A6405-98-005,A6405-98,高雄市,三民區,同德里,否,中華民國,1
2014/10/06,2014/10/12,2014/10/11,男,30-34,高雄市,鳳山區,和德里,A6412-0819-00,120.36160,22.62001,A6412-67-463,A6412-67,高雄市,鳳山區,和德里,否,中華民國,1
2015/09/19,2015/09/23,2015/09/21,男,50-54,台南市,南區,南華里,,,,,,,,,否,,1
2014/10/06,2014/10/15,2014/10/14,女,55-59,高雄市,小港區,合作里,A6411-0063-00,120.36287,22.58184,A6411-08-006,A6411-08,高雄市,小港區,合作里,否,中華民國,1
2014/10/06,2014/10/15,2014/10/13,男,50-54,高雄市,小港區,中厝里,A6411-0025-00,120.34635,22.58378,A6411-05-001,A6411-05,高雄市,小港區,中厝里,否,中華民國,1
2015/09/19,2015/09/22,2015/09/21,男,55-59,台南市,北區,和順里,,,,,,台南市,北區,和順里,否,中華民國,1
2015/09/19,2015/09/28,2015/09/28,女,45-49,台南市,安南區,溪北里,A6735-1223-00,120.21295,23.02721,A6735-49-005,A6735-49,,,,否,,1
2015/09/20,2015/09/22,2015/09/21,男,55-59,台南市,中西區,大涼里,,,,,,,,,否,,1
2015/09/20,2015/09/25,2015/09/25,女,25-29,台南市,中西區,安海里,,,,,,,,,否,,1
2014/10/06,2014/10/07,2014/10/06,男,40-44,高雄市,楠梓區,瑞屏里,,,,,,高雄市,楠梓區,瑞屏里,否,中華民國,1
2014/10/06,2014/10/08,2014/10/06,女,45-49,高雄市,新興區,黎明里,A6405-0011-00,120.32534,22.67494,A6405-02-005,A6405-02,高雄市,新興區,黎明里,否,中華民國,1
2014/10/06,2014/10/08,2014/10/07,女,25-29,高雄市,三民區,灣利里,A6405-0478-00,120.33037,22.65122,A6405-44-003,A6405-44,高雄市,三民區,灣利里,否,中華民國,1
2014/10/06,2014/10/09,2014/10/08,男,40-44,高雄市,小港區,港正里,A6411-0467-00,120.33420,22.56217,A6411-56-007,A6411-56,高雄市,小港區,港正里,否,中華民國,1
2015/09/20,2015/09/21,2015/09/21,女,30-34,台南市,東區,自強里,,,,,,,,,否,,1
2015/09/20,2015/09/21,2015/09/21,女,30-34,台南市,中西區,萬昌里,A6737-0408-00,120.20921,22.98926,A6737-19-009,A6737-19,,,,否,,1
2015/09/20,2015/09/24,2015/09/24,男,55-59,台南市,北區,東興里,,,,,,,,,否,,1
2015/09/21,2015/09/22,2015/09/22,男,35-39,台南市,北區,成德里,,,,,,,,,否,,1
2014/10/07,2014/10/13,2014/10/12,男,70+,高雄市,苓雅區,林貴里,A6408-0481-00,120.32326,22.61915,A6408-59-004,A6408-59,高雄市,苓雅區,林貴里,否,中華民國,1
2014/10/07,2014/10/13,2014/10/12,女,35-39,高雄市,鼓山區,龍子里,A6402-0350-00,120.29856,22.65459,A6402-34-002,A6402-34,高雄市,鼓山區,龍子里,否,中華民國,1
2014/10/07,2014/10/13,2014/10/12,男,3,高雄市,鼓山區,建國里,A6402-0246-00,120.27824,22.65989,A6402-25-002,A6402-25,高雄市,鼓山區,建國里,否,中華民國,1
2014/10/07,2014/10/14,2014/10/12,女,50-54,高雄市,前鎮區,忠誠里,A6409-0316-00,120.30686,22.60510,A6409-55-003,A6409-55,高雄市,前鎮區,忠誠里,否,中華民國,1
2014/10/07,2014/10/16,2014/10/15,女,60-64,高雄市,三民區,同德里,A6405-0965-00,120.30803,22.64353,A6405-86-005,A6405-86,高雄市,三民區,同德里,否,中華民國,1
2014/10/07,2014/10/08,2014/10/07,女,70+,高雄市,三民區,灣利里,A6405-0478-00,120.33037,22.65122,A6405-44-003,A6405-44,高雄市,三民區,灣利里,否,中華民國,1
2014/10/07,2014/10/09,2014/10/08,男,70+,高雄市,三民區,鼎西里,A6405-0131-00,120.31916,22.66581,A6405-09-007,A6405-09,高雄市,三民區,鼎西里,否,中華民國,1
2014/10/07,2014/10/09,2014/10/08,男,30-34,高雄市,林園區,文賢里,A6413-0376-00,120.39536,22.50134,A6413-29-167,A6413-29,高雄市,林園區,文賢里,否,中華民國,1
2014/10/07,2014/10/10,2014/10/09,女,25-29,高雄市,小港區,桂林里,A6411-0018-00,120.35383,22.58426,A6411-04-002,A6411-04,高雄市,小港區,桂林里,否,中華民國,1
2014/10/07,2014/10/10,2014/10/09,女,45-49,高雄市,小港區,高松里,A6411-0146-00,120.37248,22.57193,A6411-27-002,A6411-27,高雄市,小港區,高松里,否,中華民國,1
2014/10/07,2014/10/10,2014/10/09,男,20-24,高雄市,鼓山區,興宗里,A6402-0514-00,120.28029,22.63587,A6402-48-005,A6402-48,高雄市,鼓山區,興宗里,否,中華民國,1
2014/10/07,2014/10/10,2014/10/09,男,25-29,高雄市,三民區,本和里,A6405-0314-00,120.32843,22.65689,A6405-29-007,A6405-29,高雄市,三民區,本和里,否,中華民國,1
2015/09/21,2015/09/23,2015/09/22,男,70+,台南市,永康區,埔園里,,,,,,台南市,永康區,埔園里,否,中華民國,1
2015/09/21,2015/09/25,2015/09/25,男,20-24,台南市,南區,大忠里,,,,,,,,,否,,1
2014/10/07,2014/10/10,2014/10/09,男,50-54,高雄市,新興區,開平里,,,,,,高雄市,新興區,開平里,否,中華民國,1
2014/10/07,2014/10/10,2014/10/10,男,60-64,高雄市,三民區,鼎西里,A6405-0224-00,120.32415,22.66095,A6405-24-001,A6405-24,高雄市,三民區,鼎西里,否,中華民國,1
2014/10/07,2014/10/10,2014/10/09,女,70+,屏東縣,屏東市,崇武里,A1301-0967-00,120.47785,22.66254,A1301-66-002,A1301-66,屏東縣,屏東市,,否,中華民國,1
2014/10/07,2014/10/12,2014/10/11,男,65-69,高雄市,三民區,博惠里,A6405-1524-00,120.28906,22.63382,A6405-D9-009,A6405-D9,高雄市,三民區,博惠里,否,中華民國,1
2015/09/22,2015/09/24,2015/09/23,女,50-54,台南市,南區,明德里,A6733-0272-00,120.20242,22.97609,A6733-20-003,A6733-20,,,,否,,1
2015/09/22,2015/09/24,2015/09/23,女,50-54,台南市,北區,東興里,,,,,,,,,否,,1
2015/09/22,2015/09/26,2015/09/26,男,40-44,台南市,永康區,王行里,A6731-0169-00,120.27748,23.03395,A6731-10-007,A6731-10,,,,否,,1
2015/09/22,2015/09/24,2015/09/23,女,60-64,台南市,永康區,正強里,,,,,,,,,否,,1
2015/09/23,2015/09/24,2015/09/23,男,20-24,台南市,中西區,大南里,,,,,,,,,否,,1
2014/10/07,2014/10/08,2014/10/07,女,70+,高雄市,前鎮區,建隆里,A6409-0399-00,120.30847,22.60225,A6409-55-004,A6409-55,高雄市,前鎮區,建隆里,否,中華民國,1
2014/10/07,2014/10/09,2014/10/08,男,60-64,高雄市,苓雅區,五福里,A6408-0008-00,120.32765,22.63638,A6408-03-001,A6408-03,高雄市,苓雅區,五福里,否,中華民國,1
2014/10/07,2014/10/09,2014/10/08,男,50-54,高雄市,大寮區,永芳里,A6414-0495-00,120.39501,22.60691,A6414-30-200,A6414-30,高雄市,大寮區,永芳里,否,中華民國,1
2014/10/07,2014/10/09,2014/10/08,男,10-14,高雄市,小港區,高松里,A6411-0097-00,120.37201,22.57576,A6411-13-001,A6411-13,高雄市,小港區,高松里,否,中華民國,1
2014/10/07,2014/10/09,2014/10/08,女,50-54,高雄市,苓雅區,人和里,A6408-0487-00,120.30129,22.61893,A6408-52-007,A6408-52,高雄市,苓雅區,人和里,否,中華民國,1
2014/10/07,2014/10/10,2014/10/09,男,40-44,高雄市,鳳山區,新強里,A6412-1070-00,120.34005,22.61153,A6412-98-622,A6412-98,高雄市,鳳山區,新強里,否,中華民國,1
2014/10/07,2014/10/10,2014/10/09,男,25-29,高雄市,三民區,鼎力里,A6405-0090-00,120.31875,22.66809,A6405-07-007,A6405-07,高雄市,三民區,鼎力里,否,中華民國,1
2014/10/07,2014/10/10,2014/10/09,男,20-24,高雄市,鼓山區,光榮里,A6402-0316-00,120.28066,22.65610,A6402-30-004,A6402-30,高雄市,鼓山區,,否,中華民國,1
2014/10/07,2014/10/10,2014/10/09,男,50-54,高雄市,鼓山區,麗興里,A6402-0590-00,120.27650,22.62039,A6402-56-004,A6402-56,高雄市,鼓山區,麗興里,否,中華民國,1
2015/09/23,2015/09/24,2015/09/24,女,30-34,台南市,中西區,永福里,,,,,,台南市,七股區,大埕里,否,中華民國,1
2015/09/23,2015/09/27,2015/09/27,女,70+,台南市,中西區,光賢里,,,,,,,,,否,,1
2014/10/07,2014/10/10,2014/10/09,男,30-34,高雄市,三民區,寶玉里,A6405-0869-00,120.30463,22.64502,A6405-72-007,A6405-72,高雄市,三民區,寶玉里,否,中華民國,1
2014/10/07,2014/10/10,2014/10/08,男,65-69,高雄市,前鎮區,鎮海里,A6409-0546-00,120.31766,22.58841,A6409-67-007,A6409-67,高雄市,前鎮區,鎮海里,否,中華民國,1
2014/10/07,2014/10/10,2014/10/08,男,40-44,高雄市,前金區,北金里,A6407-0022-00,120.29340,22.63279,A6407-02-007,A6407-02,高雄市,前金區,北金里,否,中華民國,1
2014/10/07,2014/10/10,2014/10/09,男,15-19,高雄市,鳳山區,一甲里,A6412-1302-00,120.33733,22.60102,A6412-B9-732,A6412-B9,高雄市,鳳山區,一甲里,否,中華民國,1
2014/10/07,2014/10/11,2014/10/10,男,25-29,高雄市,鳳山區,三民里,A6412-0774-00,120.36290,22.62156,A6412-67-421,A6412-67,高雄市,鳳山區,三民里,否,中華民國,1
2014/10/07,2014/10/11,2014/10/10,女,40-44,高雄市,旗山區,大德里,A6430-0248-00,120.48365,22.88174,A6430-10-075,A6430-10,高雄市,旗山區,大德里,否,中華民國,1
2015/09/24,2015/09/25,2015/09/25,女,50-54,台南市,北區,玉皇里,,,,,,,,,否,,1
2015/09/24,2015/09/26,2015/09/26,男,60-64,台南市,北區,文元里,A6734-0064-00,120.19832,23.01800,A6734-04-008,A6734-04,,,,否,,1
2015/09/24,2015/09/25,2015/09/24,男,25-29,台南市,永康區,埔園里,,,,,,台南市,永康區,埔園里,否,中華民國,1
2015/09/25,2015/09/26,2015/09/26,女,50-54,台南市,北區,力行里,,,,,,,,,否,,1
2015/09/25,2015/09/26,2015/09/26,女,60-64,台南市,南區,白雪里,,,,,,台南市,南區,白雪里,否,中華民國,1
2015/09/25,2015/09/26,2015/09/26,男,30-34,台南市,安平區,文平里,,,,,,,,,否,,1
2015/09/25,2015/09/30,2015/09/28,男,15-19,台南市,永康區,中華里,,,,,,,,,否,,1
2014/10/07,2014/10/11,2014/10/10,男,60-64,高雄市,三民區,德智里,A6405-0898-00,120.31097,22.64451,A6405-93-001,A6405-93,高雄市,三民區,德智里,否,中華民國,1
2014/10/07,2014/10/11,2014/10/10,女,10-14,高雄市,鳳山區,新甲里,A6412-1195-00,120.34311,22.60725,A6412-A4-681,A6412-A4,高雄市,鳳山區,新甲里,否,中華民國,1
2014/10/07,2014/10/12,2014/10/11,女,70+,高雄市,鳳山區,大德里,A6412-1643-00,120.33220,22.59222,A6412-E6-930,A6412-E6,高雄市,鳳山區,大德里,否,中華民國,1
2014/10/07,2014/10/12,2014/10/10,女,50-54,高雄市,岡山區,程香里,A6419-0598-00,120.30440,22.79003,A6419-35-213,A6419-35,高雄市,岡山區,程香里,否,中華民國,1
2014/10/07,2014/10/14,2014/10/13,男,35-39,屏東縣,潮州鎮,泗林里,A1302-0235-00,120.56694,22.54800,A1302-15-002,A1302-15,高雄市,大寮區,,否,中華民國,1
2001/12/27,,2001/12/27,男,60-64,高雄市,前鎮區,,A6409-0592-00,120.31013,22.58498,A6409-70-007,A6409-70,高雄市,前鎮區,,否,中華民國,1
2014/10/07,2014/10/15,2014/10/14,男,30-34,高雄市,前鎮區,瑞文里,A6409-0165-00,120.33206,22.60965,A6409-17-008,A6409-17,高雄市,前鎮區,瑞平里,否,中華民國,1
2014/10/07,2014/10/16,2014/10/15,女,60-64,高雄市,三民區,灣利里,A6405-0478-00,120.33037,22.65122,A6405-44-003,A6405-44,高雄市,三民區,灣利里,否,中華民國,1
2014/10/07,2014/10/09,2014/10/08,女,30-34,高雄市,三民區,鼎西里,A6431-0036-00,120.55904,22.91368,A6431-01-010,A6431-01,高雄市,三民區,鼎西里,否,中華民國,1
2014/10/07,2014/10/09,2014/10/08,女,60-64,高雄市,前鎮區,盛興里,A6409-0056-00,120.30978,22.61340,A6409-08-005,A6409-08,高雄市,前鎮區,盛興里,否,中華民國,1
2014/10/07,2014/10/09,2014/10/08,男,65-69,高雄市,左營區,埤北里,,,,,,高雄市,左營區,埤北里,否,中華民國,1
2015/09/25,2015/09/28,2015/09/28,女,25-29,台南市,東區,崇文里,,,,,,,,,否,,1
2015/09/26,2015/09/27,2015/09/27,女,35-39,台南市,安南區,國安里,,,,,,,,,否,,1
2014/10/07,2014/10/11,2014/10/10,女,60-64,高雄市,三民區,灣中里,A6405-0594-00,120.33262,22.64916,A6405-54-005,A6405-54,高雄市,三民區,灣中里,否,中華民國,1
2014/10/07,2014/10/11,2014/10/10,女,20-24,高雄市,三民區,灣利里,A6405-0464-00,120.32098,22.65159,A6405-42-006,A6405-42,高雄市,三民區,灣利里,否,中華民國,1
2014/10/07,2014/10/12,2014/10/11,女,65-69,高雄市,三民區,鼎西里,A6405-0202-00,120.32513,22.66218,A6405-20-004,A6405-20,高雄市,三民區,鼎西里,否,中華民國,1
2014/10/07,2014/10/12,2014/10/11,男,20-24,高雄市,三民區,川東里,A6405-1242-00,120.32484,22.64018,A6405-B5-001,A6405-B5,高雄市,三民區,川東里,否,中華民國,1
2014/10/07,2014/10/12,2014/10/11,男,45-49,高雄市,前金區,三川里,A6407-0011-00,120.29718,22.63390,A6407-01-006,A6407-01,高雄市,前金區,三川里,否,中華民國,1
2014/10/07,2014/10/12,2014/10/12,女,50-54,高雄市,三民區,寶德里,A6405-1219-00,120.32983,22.64049,A6405-B2-003,A6405-B2,高雄市,三民區,寶德里,否,中華民國,1
2014/10/07,2014/10/14,2014/10/13,女,25-29,高雄市,小港區,合作里,A6411-0067-00,120.36373,22.58160,A6411-08-007,A6411-08,高雄市,小港區,合作里,否,中華民國,1
2015/09/26,2015/09/30,2015/09/26,女,55-59,台南市,南區,金華里,,,,,,,,,否,,1
2015/09/26,2015/09/26,2015/09/26,女,70+,台南市,南區,文華里,A6735-1300-00,120.20663,23.02575,A6735-53-006,A6735-53,,,,否,,1
2015/09/27,2015/09/28,2015/09/27,男,50-54,台南市,永康區,二王里,,,,,,,,,否,,1
2015/09/27,2015/09/30,2015/09/30,女,55-59,高雄市,楠梓區,,,,,,,,,,否,,1
2015/09/27,2015/09/30,2015/09/30,男,25-29,高雄市,鹽埕區,港都里,,,,,,,,,否,,1
2015/09/27,2015/09/28,2015/09/28,女,60-64,台南市,北區,華興里,,,,,,,,,否,,1
2015/09/27,2015/09/28,2015/09/28,男,60-64,台南市,永康區,五王里,,,,,,,,,否,,1
2014/10/07,2014/10/14,2014/10/13,男,20-24,高雄市,鼓山區,山下里,A6402-0538-00,120.27994,22.62958,A6402-50-005,A6402-50,高雄市,鼓山區,山下里,否,中華民國,1
2014/10/07,2014/10/15,2014/10/13,男,35-39,高雄市,前鎮區,瑞祥里,A6409-0409-00,120.32906,22.60184,A6409-53-005,A6409-53,高雄市,前鎮區,瑞祥里,否,中華民國,1
2014/10/07,2014/10/16,2014/10/15,女,45-49,高雄市,左營區,菜公里,A6403-0371-00,120.30992,22.68289,A6403-26-004,A6403-26,高雄市,左營區,菜公里,否,中華民國,1
2015/09/27,2015/09/29,2015/09/28,男,50-54,台南市,南區,光明里,,,,,,,,,否,,1
2015/09/27,2015/09/29,2015/09/28,女,40-44,台南市,安南區,溪北里,A6735-1302-00,120.21239,23.02555,A6735-49-010,A6735-49,台南市,安南區,溪北里,否,中華民國,1
2015/09/27,2015/09/29,2015/09/28,男,50-54,台南市,東區,富強里,A6732-0357-00,120.23029,22.98673,A6732-15-010,A6732-15,台南市,東區,富強里,否,中華民國,1
2014/10/08,2014/10/11,2014/10/10,女,25-29,高雄市,三民區,安宜里,A6405-0808-00,120.31272,22.64593,A6405-74-006,A6405-74,高雄市,三民區,安宜里,否,中華民國,1
2014/10/08,2014/10/12,2014/10/11,男,20-24,高雄市,左營區,新光里,A6403-0555-00,120.30340,22.67636,A6403-45-004,A6403-45,高雄市,左營區,新光里,否,中華民國,1
2014/10/08,2014/10/12,2014/10/11,男,35-39,高雄市,三民區,鼎中里,A6405-1422-00,120.30394,22.63741,A6405-C9-004,A6405-C9,高雄市,三民區,鼎中里,否,中華民國,1
2014/10/08,2014/10/12,2014/10/11,女,50-54,高雄市,三民區,安吉里,A6405-0954-00,120.33122,22.64380,A6405-97-002,A6405-97,高雄市,三民區,安吉里,否,中華民國,1
2014/10/08,2014/10/12,2014/10/11,女,30-34,高雄市,前鎮區,瑞竹里,A6409-0352-00,120.32336,22.60396,A6409-45-005,A6409-45,高雄市,前鎮區,瑞竹里,否,中華民國,1
2014/10/08,2014/10/12,2014/10/11,男,60-64,高雄市,新興區,漢民里,A6406-0193-00,120.31348,22.62818,A6406-18-008,A6406-18,高雄市,新興區,漢民里,否,中華民國,1
2014/10/08,2014/10/13,2014/10/12,男,40-44,高雄市,鹽埕區,南端里,A6401-0112-00,120.28668,22.62147,A6401-13-003,A6401-13,高雄市,鹽埕區,南端里,否,中華民國,1
2014/10/08,2014/10/13,2014/10/12,女,60-64,高雄市,鳳山區,善美里,A6412-1253-00,120.33726,22.60310,A6412-A9-713,A6412-A9,高雄市,鳳山區,善美里,否,中華民國,1
2014/10/08,2014/10/14,2014/10/13,女,10-14,高雄市,三民區,灣勝里,A6405-0492-00,120.30513,22.65093,A6405-46-002,A6405-46,高雄市,三民區,灣勝里,否,中華民國,1
2014/10/08,2014/10/14,2014/10/13,男,45-49,台南市,麻豆區,安西里,,,,,,台南市,麻豆區,安西里,否,中華民國,1
2014/10/08,2014/10/14,2014/10/13,男,20-24,高雄市,鼓山區,龍子里,A6402-0309-00,120.29274,22.65669,A6402-29-004,A6402-29,高雄市,鼓山區,龍子里,否,中華民國,1
2014/10/08,2014/10/15,2014/10/14,女,15-19,高雄市,前鎮區,西甲里,A6409-0122-00,120.30831,22.61079,A6409-11-007,A6409-11,高雄市,前鎮區,西甲里,否,中華民國,1
2014/10/08,2014/10/16,2014/10/15,男,70+,高雄市,新興區,光耀里,A6406-0161-00,120.30779,22.62988,A6406-16-005,A6406-16,高雄市,新興區,光耀里,否,中華民國,1
2014/10/08,2014/10/12,2014/10/11,女,55-59,高雄市,三民區,寶德里,A6405-1135-00,120.29554,22.64138,A6405-B6-002,A6405-B6,高雄市,三民區,寶德里,否,中華民國,1
2014/10/08,2014/10/15,2014/10/14,女,60-64,台南市,南區,再興里,A6733-0169-00,120.19279,22.97939,A6733-10-005,A6733-10,,,,是,中國大陸,1
2014/10/08,2014/10/15,2014/10/14,男,60-64,台南市,南區,再興里,A6733-0169-00,120.19279,22.97939,A6733-10-005,A6733-10,,,,是,中國大陸,1
2014/10/08,2014/10/14,2014/10/13,男,70+,高雄市,苓雅區,普照里,A6408-0496-00,120.31153,22.61885,A6408-63-003,A6408-63,高雄市,苓雅區,普照里,否,中華民國,1
2014/10/08,2014/10/14,2014/10/13,女,10-14,高雄市,苓雅區,正言里,A6408-0141-00,120.32771,22.63062,A6408-13-007,A6408-13,高雄市,苓雅區,正言里,否,中華民國,1
2014/10/08,2014/10/14,2014/10/13,女,45-49,高雄市,前鎮區,良和里,A6409-0243-00,120.30659,22.60761,A6409-19-007,A6409-19,高雄市,前鎮區,良和里,否,中華民國,1
2014/10/08,2014/10/15,2014/10/14,男,50-54,高雄市,楠梓區,裕昌里,,,,,,高雄市,楠梓區,裕昌里,否,中華民國,1
2014/10/08,2014/10/15,2014/10/14,女,65-69,高雄市,苓雅區,凱旋里,A6408-0168-00,120.32093,22.62956,A6408-21-001,A6408-21,高雄市,苓雅區,凱旋里,否,中華民國,1
2014/10/08,2014/10/15,2014/10/14,女,40-44,高雄市,前鎮區,西山里,,,,,,高雄市,前鎮區,西山里,否,中華民國,1
2014/10/08,2014/10/15,2014/10/14,男,5-9,高雄市,三民區,正興里,A6405-0756-00,120.31661,22.64656,A6405-66-005,A6405-66,高雄市,三民區,正興里,否,中華民國,1
2014/10/08,2014/10/15,2014/10/14,女,25-29,高雄市,鳳山區,正義里,A6412-1212-00,120.33935,22.60546,A6412-A7-698,A6412-A7,高雄市,鳳山區,正義里,否,中華民國,1
2014/10/08,2014/10/15,2014/10/14,男,55-59,高雄市,苓雅區,正大里,A6408-0119-00,120.33303,22.63119,A6408-16-003,A6408-16,高雄市,苓雅區,正大里,否,中華民國,1
2014/10/08,2014/10/15,2014/10/14,女,30-34,高雄市,鳳山區,南成里,A6412-1650-00,120.33397,22.59204,A6412-E0-932,A6412-E0,高雄市,鳳山區,南成里,否,中華民國,1
2014/10/08,2014/10/17,2014/10/16,女,70+,高雄市,前鎮區,瑞南里,A6409-0456-00,120.32447,22.59819,A6409-60-001,A6409-60,高雄市,前鎮區,瑞南里,否,中華民國,1
2014/10/08,2014/10/18,2014/10/15,女,20-24,高雄市,三民區,鼎盛里,A6405-0025-00,120.32569,22.67378,A6405-04-002,A6405-04,高雄市,三民區,鼎盛里,否,中華民國,1
2014/10/08,2014/10/18,2014/10/17,女,50-54,高雄市,三民區,本元里,A6405-0475-00,120.30514,22.65119,A6405-46-002,A6405-46,高雄市,三民區,本元里,否,中華民國,1
2014/10/08,2014/11/06,2014/10/13,女,70+,高雄市,小港區,中厝里,A6411-0031-00,120.34810,22.58352,A6411-03-007,A6411-03,高雄市,小港區,中厝里,否,中華民國,1
2014/10/08,2014/10/14,2014/10/13,男,15-19,高雄市,三民區,灣利里,A6405-0464-00,120.32098,22.65159,A6405-42-006,A6405-42,高雄市,三民區,灣利里,否,中華民國,1
2014/10/08,2014/10/14,2014/10/13,女,50-54,高雄市,鳳山區,武松里,A6412-0242-00,120.36341,22.63565,A6412-17-127,A6412-17,高雄市,鳳山區,武松里,否,中華民國,1
2014/10/08,2014/10/14,2014/10/13,男,10-14,高雄市,大寮區,後庄里,A6414-0079-00,120.39412,22.63784,A6414-02-032,A6414-02,高雄市,大寮區,後庄里,否,中華民國,1
2014/10/08,2014/10/16,2014/10/15,女,65-69,高雄市,三民區,鼎西里,A6405-0216-00,120.32491,22.66146,A6405-24-002,A6405-24,高雄市,三民區,鼎西里,否,中華民國,1
2014/10/08,2014/10/17,2014/10/15,男,60-64,高雄市,三民區,鼎中里,A6405-0190-00,120.32029,22.66263,A6405-17-006,A6405-17,高雄市,三民區,鼎中里,否,中華民國,1
2014/10/09,2014/10/10,2014/10/09,女,40-44,高雄市,三民區,灣利里,A6405-0446-00,120.33376,22.65206,A6405-43-002,A6405-43,高雄市,三民區,灣利里,否,中華民國,1
2014/10/09,2014/10/10,2014/10/09,女,60-64,高雄市,小港區,中厝里,A6411-0011-00,120.34903,22.58458,A6411-03-001,A6411-03,高雄市,小港區,中厝里,否,中華民國,1
2014/10/09,2014/10/11,2014/10/10,女,45-49,高雄市,前鎮區,瑞誠里,A6409-0088-00,120.32986,22.61194,A6409-17-003,A6409-17,高雄市,前鎮區,瑞誠里,否,中華民國,1
2014/10/09,2014/10/11,2014/10/10,男,45-49,屏東縣,東港鎮,頂中里,A1303-0130-00,120.44984,22.46751,A1303-11-003,A1303-11,屏東縣,東港鎮,,否,中華民國,1
2014/10/09,2014/10/11,2014/10/09,女,25-29,高雄市,左營區,新光里,A6403-0607-00,120.30135,22.67478,A6403-51-001,A6403-51,高雄市,左營區,新光里,否,中華民國,1
2014/10/09,2014/10/12,2014/10/11,男,70+,高雄市,小港區,山東里,A6411-0161-00,120.35016,22.57116,A6411-22-005,A6411-22,高雄市,小港區,山東里,否,中華民國,1
2014/10/09,2014/10/12,2014/10/11,男,50-54,高雄市,鳳山區,大德里,A6412-1727-00,120.33191,22.58916,A6412-E9-962,A6412-E9,高雄市,鳳山區,大德里,否,中華民國,1
2014/10/09,2014/10/12,2014/10/11,男,25-29,高雄市,三民區,鼎西里,A6405-0215-00,120.32389,22.66157,A6405-24-001,A6405-24,高雄市,三民區,鼎西里,否,中華民國,1
2014/10/09,2014/10/12,2014/10/11,男,65-69,高雄市,鳳山區,新富里,A6412-0989-00,120.34611,22.61416,A6412-91-564,A6412-91,高雄市,鳳山區,新富里,否,中華民國,1
2014/10/09,2014/10/12,2014/10/11,男,70+,高雄市,鳥松區,華美里,A6418-0121-00,120.39475,22.66302,A6418-06-039,A6418-06,高雄市,鳥松區,華美里,否,中華民國,1
2014/10/09,2014/10/13,2014/10/12,女,50-54,高雄市,鳳山區,中和里,A6412-0585-00,120.34655,22.62649,A6412-50-333,A6412-50,高雄市,鳳山區,中和里,否,中華民國,1
2014/10/09,2014/10/13,2014/10/12,男,50-54,高雄市,鳳山區,埤頂里,A6412-0384-00,120.37845,22.63138,A6412-29-223,A6412-29,高雄市,鳳山區,埤頂里,否,中華民國,1
2014/10/09,2014/10/13,2014/10/12,男,55-59,高雄市,前鎮區,明道里,A6409-0612-00,120.32151,22.58409,A6409-72-008,A6409-72,高雄市,前鎮區,明禮里,否,中華民國,1
2014/10/09,2014/10/13,2014/10/12,男,65-69,高雄市,鹽埕區,陸橋里,A6401-0030-00,120.28057,22.62874,A6401-04-001,A6401-04,高雄市,鹽埕區,陸橋里,否,中華民國,1
2014/10/09,2014/10/13,2014/10/12,男,65-69,高雄市,三民區,灣利里,A6405-0418-00,120.32973,22.65281,A6405-41-002,A6405-41,高雄市,三民區,灣利里,否,中華民國,1