發病日,個案研判日,通報日,性別,年齡層,居住縣市,居住鄉鎮,居住村里,感染縣市,感染鄉鎮,感染村里,是否境外移入,感染國家,確定病例數
2002/11/15,,2002/11/20,男,55-59,高雄市,鳳山區,,,,,否,,1
2014/10/21,2014/10/23,2014/10/22,女,45-49,高雄市,三民區,寶興里,高雄市,三民區,寶興里,否,中華民國,1
2014/10/21,2014/10/23,2014/10/22,女,25-29,高雄市,三民區,同德里,高雄市,三民區,同德里,否,中華民國,1
2014/10/21,2014/10/23,2014/10/22,女,25-29,高雄市,三民區,博惠里,高雄市,三民區,博惠里,否,中華民國,1
2014/11/03,2014/11/07,2014/11/06,女,60-64,高雄市,苓雅區,林華里,高雄市,苓雅區,林華里,否,中華民國,1
2014/11/03,2014/11/07,2014/11/06,男,55-59,台南市,東區,崇善里,台南市,東區,崇善里,否,中華民國,1
2014/11/04,2014/11/12,2014/11/11,女,55-59,高雄市,鳳山區,善美里,高雄市,鳳山區,善美里,否,中華民國,1
2014/11/04,2014/11/12,2014/11/10,男,25-29,高雄市,前鎮區,建隆里,高雄市,前鎮區,建隆里,否,中華民國,1
2014/11/04,2014/11/12,2014/11/11,女,40-44,高雄市,鳳山區,新強里,高雄市,鳳山區,新強里,否,中華民國,1
2014/11/04,2014/11/12,2014/11/11,男,45-49,高雄市,苓雅區,林興里,高雄市,苓雅區,林興里,否,中華民國,1
2014/11/04,2014/11/12,2014/11/12,男,25-29,高雄市,三民區,鼎西里,高雄市,三民區,鼎西里,否,中華民國,1
2014/11/04,2014/11/12,2014/11/11,女,60-64,高雄市,三民區,寶民里,高雄市,三民區,寶民里,否,中華民國,1
2014/11/04,2014/11/15,2014/11/13,男,10-14,高雄市,鼓山區,明誠里,高雄市,鼓山區,明誠里,否,中華民國,1
2014/11/04,2014/11/05,2014/11/04,女,10-14,高雄市,鹽埕區,陸橋里,高雄市,鹽埕區,陸橋里,否,中華民國,1
2014/11/24,2014/11/26,2014/11/25,男,50-54,高雄市,三民區,正順里,高雄市,三民區,正順里,否,中華民國,1
2015/04/28,2015/05/06,2015/05/04,男,55-59,高雄市,左營區,新中里,,,,是,印尼,1
2015/07/26,2015/07/28,2015/07/27,女,70+,台南市,北區,成德里,台南市,北區,成德里,否,中華民國,1
2015/08/05,2015/08/07,2015/08/06,女,70+,台南市,北區,勝安里,台南市,北區,勝安里,否,中華民國,1
2015/08/08,2015/08/10,2015/08/09,女,15-19,台南市,北區,實踐里,台南市,北區,實踐里,否,中華民國,1
2015/08/08,2015/08/10,2015/08/09,女,20-24,台南市,北區,勝安里,台南市,北區,勝安里,否,中華民國,1
2015/08/16,2015/08/20,2015/08/19,男,50-54,台南市,北區,國姓里,台南市,北區,國姓里,否,中華民國,1
2015/08/21,2015/08/28,2015/08/26,女,20-24,台南市,北區,中樓里,台南市,北區,中樓里,否,中華民國,1
2015/08/23,2015/08/26,2015/08/24,男,10-14,台南市,南區,南都里,台南市,南區,南都里,否,中華民國,1
2015/09/02,2015/09/04,2015/09/03,女,55-59,台南市,北區,振興里,台南市,北區,振興里,否,中華民國,1
2015/09/02,2015/09/04,2015/09/03,男,45-49,台南市,柳營區,人和里,台南市,柳營區,人和里,否,中華民國,1
2015/08/30,2015/09/03,2015/09/02,女,55-59,台南市,東區,中西里,台南市,東區,中西里,否,中華民國,1
2015/08/31,2015/09/04,2015/09/03,女,20-24,台南市,北區,興南里,台南市,北區,興南里,否,中華民國,1
2015/08/31,2015/09/08,2015/09/07,女,55-59,台南市,永康區,安康里,,,,否,,1
2015/09/01,2015/09/03,2015/09/02,女,55-59,高雄市,三民區,,,,,否,,1
2015/09/01,2015/09/08,2015/09/07,女,70+,台南市,中西區,光賢里,,,,否,,1
2015/09/01,2015/09/06,2015/09/04,男,45-49,台北市,文山區,萬年里,,,,否,中華民國,1
2015/09/02,2015/09/06,2015/09/04,女,50-54,台南市,北區,延平里,,,,否,,1
2015/09/02,2015/09/06,2015/09/04,女,40-44,台南市,安平區,建平里,台南市,安平區,建平里,否,中華民國,1
2015/09/02,2015/09/06,2015/09/05,男,20-24,台南市,永康區,五王里,台南市,永康區,五王里,否,中華民國,1
2015/09/02,2015/09/07,2015/09/05,女,60-64,台南市,北區,正覺里,台南市,北區,正覺里,否,中華民國,1
2015/09/02,2015/09/08,2015/09/07,女,55-59,台南市,北區,,,,,否,,1
2015/09/03,2015/09/05,2015/09/04,男,70+,台南市,南區,日新里,,,,否,,1
2015/09/03,2015/09/07,2015/09/05,女,35-39,台南市,永康區,復華里,,,,否,,1
2015/09/03,2015/09/05,2015/09/04,女,15-19,台南市,北區,玉皇里,台南市,北區,玉皇里,否,中華民國,1
2015/09/04,2015/09/10,2015/09/07,女,70+,台南市,南區,光明里,,,,否,,1
2015/09/04,2015/09/07,2015/09/06,女,55-59,高雄市,苓雅區,凱旋里,,,,否,,1
2015/09/05,2015/09/09,2015/09/07,女,50-54,台南市,南區,田寮里,,,,否,,1
2015/09/05,2015/09/08,2015/09/07,女,45-49,台南市,南區,田寮里,,,,否,,1
2015/09/05,2015/09/10,2015/09/09,男,20-24,台南市,永康區,尚頂里,台南市,永康區,尚頂里,否,中華民國,1
2015/09/05,2015/09/10,2015/09/09,女,40-44,台南市,永康區,甲頂里,台南市,永康區,甲頂里,否,中華民國,1
2015/09/05,2015/09/08,2015/09/07,女,60-64,台南市,安南區,理想里,,,,否,,1
2015/09/06,2015/09/13,2015/09/12,女,5-9,高雄市,楠梓區,瑞屏里,高雄市,楠梓區,瑞屏里,否,中華民國,1
2015/09/06,2015/09/14,2015/09/14,女,60-64,台南市,六甲區,六甲里,台南市,六甲區,六甲里,否,中華民國,1
2015/09/06,2015/09/15,2015/09/15,女,45-49,台南市,南區,建南里,台南市,南區,建南里,否,中華民國,1
2015/09/06,2015/09/07,2015/09/06,男,45-49,台南市,仁德區,保安里,台南市,仁德區,保安里,否,中華民國,1
2015/09/06,2015/09/07,2015/09/06,男,60-64,台南市,中西區,中正里,台南市,安平區,平通里,否,中華民國,1
2015/09/06,2015/09/07,2015/09/06,男,55-59,台南市,永康區,復國里,台南市,永康區,復國里,否,中華民國,1
2015/09/06,2015/09/07,2015/09/07,女,5-9,台南市,新營區,民榮里,台南市,新營區,民榮里,否,中華民國,1
2015/09/06,2015/09/07,2015/09/06,女,70+,台南市,中西區,民權里,台南市,中西區,民權里,否,中華民國,1
2015/09/06,2015/09/08,2015/09/07,女,20-24,台南市,永康區,鹽行里,台南市,永康區,鹽行里,否,中華民國,1
2015/09/06,2015/09/08,2015/09/07,男,15-19,台南市,安南區,海佃里,台南市,安南區,海佃里,否,中華民國,1
2015/09/06,2015/09/08,2015/09/07,女,70+,台南市,北區,正覺里,台南市,北區,正覺里,否,中華民國,1
2015/09/06,2015/09/08,2015/09/07,女,30-34,台南市,北區,小康里,台南市,北區,小康里,否,中華民國,1
2015/09/06,2015/09/08,2015/09/07,女,30-34,台南市,安南區,安慶里,台南市,安南區,安慶里,否,中華民國,1
2015/09/06,2015/09/08,2015/09/07,男,15-19,台南市,安南區,溪北里,台南市,安南區,溪北里,否,中華民國,1
2015/09/06,2015/09/08,2015/09/07,女,60-64,台南市,北區,正風里,台南市,北區,正風里,否,中華民國,1
2015/09/06,2015/09/09,2015/09/07,女,35-39,台南市,南區,明亮里,,,,否,,1
2015/09/06,2015/09/11,2015/09/10,女,25-29,台南市,南區,廣州里,,,,否,,1
2015/09/07,2015/09/14,2015/09/13,女,55-59,台南市,東區,小東里,,,,否,,1
2015/09/07,2015/09/09,2015/09/08,女,5-9,台南市,北區,延平里,台南市,北區,延平里,否,中華民國,1
2015/09/07,2015/09/10,2015/09/08,女,65-69,台南市,北區,大豐里,台南市,北區,大豐里,否,中華民國,1
2015/09/07,2015/09/08,2015/09/07,男,70+,台南市,北區,五福里,,,,否,,1
2015/09/07,2015/09/09,2015/09/08,女,45-49,台南市,南區,明亮里,台南市,南區,明亮里,否,中華民國,1
2015/09/08,2015/09/15,2015/09/14,男,50-54,台南市,北區,文成里,,,,否,,1
2015/09/08,2015/09/10,2015/09/09,女,50-54,台南市,東區,泉南里,台南市,東區,泉南里,否,中華民國,1
2015/09/08,2015/09/11,2015/09/09,男,30-34,新北市,瑞芳區,吉安里,,,,否,中華民國,1
2015/09/08,2015/09/11,2015/09/10,女,15-19,台南市,永康區,五王里,台南市,永康區,五王里,否,中華民國,1
2015/09/08,2015/09/11,2015/09/10,男,35-39,台南市,中西區,水仙里,台南市,中西區,水仙里,否,中華民國,1
2015/09/08,2015/09/11,2015/09/10,男,15-19,台南市,永康區,永康里,台南市,永康區,永康里,否,中華民國,1
2015/09/08,2015/09/11,2015/09/10,男,60-64,台南市,永康區,大橋里,台南市,永康區,大橋里,否,中華民國,1
2015/09/08,2015/09/11,2015/09/10,男,35-39,台南市,永康區,正強里,台南市,永康區,正強里,否,中華民國,1
2015/09/08,2015/09/11,2015/09/10,男,5-9,台南市,北區,大和里,台南市,北區,大和里,否,中華民國,1
2015/09/08,2015/09/11,2015/09/10,女,40-44,台南市,南區,明興里,台南市,南區,明興里,否,中華民國,1
2015/09/08,2015/09/11,2015/09/10,男,55-59,台南市,南區,國宅里,,,,否,,1
2015/09/08,2015/09/11,2015/09/10,女,65-69,台南市,南區,田寮里,,,,否,,1
2015/09/09,2015/09/11,2015/09/10,男,20-24,台南市,南區,田寮里,,,,否,,1
2015/09/09,2015/09/12,2015/09/10,女,50-54,台南市,北區,興南里,,,,否,,1
2015/09/10,2015/09/14,2015/09/13,男,55-59,台南市,北區,延平里,,,,否,,1
2002/11/24,,2002/11/25,女,15-19,屏東縣,屏東市,,,,,否,,1
2015/09/10,2015/09/11,2015/09/10,男,60-64,台南市,南區,田寮里,台南市,南區,田寮里,否,中華民國,1
2015/09/10,2015/09/11,2015/09/10,男,20-24,台南市,南區,大忠里,台南市,南區,大忠里,否,中華民國,1
2015/09/10,2015/09/11,2015/09/10,女,15-19,台南市,安南區,梅花里,台南市,安南區,梅花里,否,中華民國,1
2015/09/10,2015/09/11,2015/09/10,女,40-44,高雄市,三民區,寶安里,高雄市,三民區,寶安里,否,中華民國,1
2015/09/10,2015/09/11,2015/09/10,男,45-49,台南市,北區,五福里,台南市,北區,五福里,否,中華民國,1
2015/09/10,2015/09/11,2015/09/10,女,15-19,台南市,安南區,顯宮里,台南市,安南區,顯宮里,否,中華民國,1
2015/09/10,2015/09/12,2015/09/11,女,60-64,台南市,北區,正覺里,台南市,北區,正覺里,否,中華民國,1
2015/09/10,2015/09/12,2015/09/11,男,40-44,台南市,安南區,大安里,台南市,安南區,大安里,否,中華民國,1
2015/09/10,2015/09/12,2015/09/11,女,25-29,台南市,北區,大和里,台南市,北區,大和里,否,中華民國,1
2015/09/10,2015/09/12,2015/09/11,女,15-19,台南市,安平區,億載里,台南市,安平區,億載里,否,中華民國,1
2015/09/10,2015/09/12,2015/09/11,女,70+,台南市,南區,建南里,台南市,南區,建南里,否,中華民國,1
2015/09/10,2015/09/12,2015/09/11,女,60-64,台南市,南區,同安里,台南市,南區,同安里,否,中華民國,1
2015/09/10,2015/09/12,2015/09/11,男,15-19,台南市,東區,大智里,台南市,東區,大智里,否,中華民國,1
2015/09/10,2015/09/12,2015/09/11,女,40-44,高雄市,楠梓區,盛昌里,高雄市,楠梓區,盛昌里,否,中華民國,1
2015/09/10,2015/09/12,2015/09/11,男,55-59,高雄市,旗津區,中洲里,高雄市,旗津區,中洲里,否,中華民國,1
2015/09/10,2015/09/12,2015/09/10,男,15-19,高雄市,前鎮區,明道里,高雄市,前鎮區,明道里,否,中華民國,1
2015/09/10,2015/09/12,2015/09/11,男,50-54,台南市,安南區,長安里,台南市,安南區,長安里,否,中華民國,1
2015/09/10,2015/09/12,2015/09/11,男,70+,台南市,安南區,總頭里,台南市,安南區,總頭里,否,中華民國,1
2015/09/10,2015/09/12,2015/09/11,男,20-24,高雄市,仁武區,,高雄市,仁武區,,否,中華民國,1
2015/09/10,2015/09/16,2015/09/15,女,70+,台南市,南區,省躬里,,,,否,,1
2015/09/11,,2015/09/15,女,15-19,台南市,中西區,,,,,否,,1
2015/09/11,2015/09/12,2015/09/12,女,15-19,台南市,北區,五福里,台南市,北區,五福里,否,中華民國,1
2015/09/12,2015/09/13,2015/09/12,男,25-29,台南市,南區,廣州里,,,,否,,1
2015/09/12,2015/09/16,2015/09/14,女,50-54,台南市,東區,圍下里,台南市,東區,圍下里,否,中華民國,1
2015/09/12,2015/09/16,2015/09/14,女,5-9,台南市,南區,文南里,台南市,南區,文南里,否,中華民國,1
2015/09/12,2015/09/16,2015/09/15,女,10-14,台南市,北區,成德里,,,,否,,1
2015/09/12,2015/09/13,2015/09/12,男,45-49,台南市,永康區,二王里,台南市,永康區,二王里,否,中華民國,1
2015/09/12,2015/09/14,2015/09/13,女,40-44,台南市,東區,小東里,台南市,東區,小東里,否,中華民國,1
2015/09/12,2015/09/14,2015/09/13,女,70+,台南市,北區,正風里,台南市,北區,正風里,否,中華民國,1
2015/09/12,2015/09/14,2015/09/13,男,15-19,台南市,北區,大港里,台南市,北區,大港里,否,中華民國,1
2015/09/12,2015/09/14,2015/09/13,男,70+,台南市,東區,虎尾里,,,,否,,1
2015/09/12,2015/09/14,2015/09/13,女,70+,台南市,永康區,中華里,台南市,永康區,中華里,否,中華民國,1
2015/09/12,2015/09/15,2015/09/14,女,50-54,高雄市,苓雅區,福西里,高雄市,苓雅區,福西里,否,中華民國,1
2015/09/12,2015/09/15,2015/09/14,男,10-14,高雄市,小港區,廈莊里,高雄市,小港區,廈莊里,否,中華民國,1
2015/09/12,2015/09/15,2015/09/14,女,45-49,高雄市,苓雅區,苓洲里,高雄市,苓雅區,苓洲里,否,中華民國,1
2015/09/12,2015/09/15,2015/09/14,女,40-44,高雄市,三民區,十美里,高雄市,三民區,十美里,否,中華民國,1
2015/09/12,2015/09/15,2015/09/14,男,70+,高雄市,三民區,安吉里,高雄市,三民區,安吉里,否,中華民國,1
2015/09/12,2015/09/15,2015/09/14,女,60-64,高雄市,左營區,尾北里,高雄市,左營區,尾北里,否,中華民國,1
2015/09/12,2015/09/15,2015/09/14,男,10-14,高雄市,左營區,新光里,高雄市,左營區,新光里,否,中華民國,1
2015/09/12,2015/09/15,2015/09/13,男,65-69,台南市,北區,仁愛里,,,,否,,1
2015/09/12,2015/09/15,2015/09/13,女,50-54,台南市,永康區,勝利里,台南市,永康區,勝利里,否,中華民國,1
2015/09/12,2015/09/15,2015/09/14,女,70+,台南市,東區,崇信里,台南市,東區,崇信里,否,中華民國,1
2015/09/12,2015/09/15,2015/09/14,男,25-29,台南市,中西區,西湖里,台南市,中西區,西湖里,否,中華民國,1
2015/09/12,2015/09/15,2015/09/14,女,5-9,台南市,安平區,金城里,台南市,安平區,金城里,否,中華民國,1
2015/09/12,2015/09/15,2015/09/14,女,55-59,台南市,安平區,平通里,台南市,安平區,平通里,否,中華民國,1
2015/09/12,2015/09/15,2015/09/14,女,70+,台南市,中西區,中正里,台南市,中西區,中正里,否,中華民國,1
2015/09/12,2015/09/15,2015/09/14,女,30-34,台南市,北區,文元里,台南市,北區,大和里,否,中華民國,1
2015/09/12,2015/09/15,2015/09/14,男,60-64,台南市,中西區,水仙里,台南市,中西區,三合里,否,中華民國,1
2015/09/12,2015/09/15,2015/09/14,男,70+,台南市,北區,公園里,台南市,北區,公園里,否,中華民國,1
2015/09/12,2015/09/15,2015/09/14,男,30-34,台南市,中西區,藥王里,台南市,中西區,藥王里,否,中華民國,1
2015/09/12,2015/09/15,2015/09/14,男,30-34,台南市,永康區,永康里,台南市,永康區,永康里,否,中華民國,1
2015/09/12,2015/09/16,2015/09/15,女,55-59,台南市,歸仁區,南保里,,,,否,,1
2015/09/12,2015/09/15,2015/09/13,男,70+,台南市,東區,崇明里,台南市,東區,崇明里,否,中華民國,1
2015/09/12,2015/09/15,2015/09/13,男,5-9,高雄市,茄萣區,白雲里,高雄市,茄萣區,白雲里,否,中華民國,1
2015/09/12,2015/09/15,2015/09/14,男,70+,台南市,北區,國興里,台南市,北區,國興里,否,中華民國,1
2015/09/12,2015/09/15,2015/09/14,男,70+,台南市,北區,興北里,台南市,北區,興北里,否,中華民國,1
2015/09/12,2015/09/15,2015/09/14,女,35-39,台南市,永康區,五王里,台南市,永康區,,否,中華民國,1
2015/09/12,2015/09/15,2015/09/14,男,60-64,台南市,中西區,協和里,台南市,中西區,協和里,否,中華民國,1
2015/09/12,2015/09/15,2015/09/14,女,65-69,台南市,南區,田寮里,,,,否,,1
2015/09/12,2015/09/15,2015/09/14,男,60-64,台南市,安定區,海寮里,台南市,安定區,海寮里,否,中華民國,1
2015/09/12,2015/09/15,2015/09/14,男,15-19,台南市,永康區,埔園里,台南市,永康區,埔園里,否,中華民國,1
2015/09/12,2015/09/15,2015/09/15,男,20-24,台南市,仁德區,太子里,台南市,仁德區,太子里,否,中華民國,1
2015/09/12,2015/09/15,2015/09/14,男,30-34,台南市,北區,長德里,台南市,北區,長德里,否,中華民國,1
2015/09/12,2015/09/15,2015/09/14,女,50-54,台南市,永康區,安康里,台南市,永康區,安康里,否,中華民國,1
2015/09/12,2015/09/15,2015/09/14,女,50-54,台南市,南區,新昌里,台南市,南區,新昌里,否,中華民國,1
2015/09/12,2015/09/15,2015/09/14,男,70+,台南市,東區,莊敬里,台南市,東區,莊敬里,否,中華民國,1
2015/09/12,2015/09/15,2015/09/14,男,30-34,台南市,安平區,石門里,台南市,安平區,石門里,否,中華民國,1
2015/09/12,2015/09/15,2015/09/14,女,55-59,台南市,南區,彰南里,台南市,南區,彰南里,否,中華民國,1
2001/08/23,,2001/08/28,男,45-49,台南市,永康區,,台南市,永康區,,否,中華民國,1
2015/08/26,2015/08/30,2015/08/30,男,5-9,台南市,北區,開元里,台南市,北區,開元里,否,中華民國,1
2015/08/27,2015/09/04,2015/09/03,男,5-9,高雄市,楠梓區,惠民里,,,,是,越南,1
2015/08/28,2015/08/29,2015/08/29,女,25-29,台中市,神岡區,,,,,是,菲律賓,1
2015/08/28,2015/09/01,2015/08/31,女,70+,台南市,南區,明亮里,台南市,南區,明亮里,否,中華民國,1
2015/08/28,2015/09/01,2015/08/28,男,20-24,台南市,北區,大豐里,台南市,北區,大豐里,否,中華民國,1
2015/08/28,2015/09/02,2015/09/01,男,50-54,台南市,南區,文華里,台南市,南區,文華里,否,中華民國,1
2015/08/28,2015/09/02,2015/09/01,男,70+,台南市,南區,新興里,台南市,南區,新興里,否,中華民國,1
2015/08/28,2015/08/29,2015/08/28,男,70+,台南市,北區,光武里,台南市,北區,光武里,否,中華民國,1
2015/08/29,2015/08/31,2015/08/31,男,25-29,台南市,東區,小東里,台南市,東區,小東里,否,中華民國,1
2015/08/29,2015/09/03,2015/09/01,男,5-9,台南市,安平區,平安里,台南市,安平區,平安里,否,中華民國,1
2015/08/30,2015/09/03,2015/09/02,女,50-54,台南市,北區,永祥里,台南市,北區,永祥里,否,中華民國,1
2015/08/30,2015/09/03,2015/09/02,女,65-69,台南市,北區,正覺里,台南市,北區,正覺里,否,中華民國,1
2006/09/24,2006/10/09,2006/09/27,女,50-54,高雄市,鳳山區,福興里,高雄市,鳳山區,,否,中華民國,1
2006/09/24,2006/10/13,2006/09/30,女,25-29,高雄市,鳳山區,保安里,高雄市,鳳山區,,否,中華民國,1
2006/09/24,2006/09/27,2006/09/27,男,20-24,桃園市,觀音區,樹林里,,,,是,泰國,1
2006/09/24,2006/10/01,2006/09/27,女,35-39,高雄市,苓雅區,林中里,高雄市,苓雅區,,否,中華民國,1
2006/09/24,2006/10/01,2006/09/30,女,70+,高雄市,鳳山區,富甲里,高雄市,鳳山區,,否,中華民國,1
2006/09/24,2006/10/05,2006/09/28,女,65-69,高雄市,鳳山區,新甲里,高雄市,鳳山區,,否,中華民國,1
2006/09/24,2006/11/03,2006/10/01,女,35-39,高雄市,苓雅區,林西里,高雄市,苓雅區,,否,中華民國,1
2006/09/24,2006/09/28,2006/09/26,男,70+,高雄市,苓雅區,林西里,高雄市,苓雅區,,否,中華民國,1
2006/09/24,2006/09/30,2006/09/28,女,45-49,高雄市,鳳山區,正義里,高雄市,鳳山區,,否,中華民國,1
2006/09/24,2006/10/04,2006/09/26,男,30-34,屏東縣,竹田鄉,六巷村,高雄市,小港區,,否,中華民國,1
2006/09/24,2006/10/02,2006/09/29,男,10-14,高雄市,前鎮區,明孝里,高雄市,前鎮區,,否,中華民國,1
2007/07/13,2007/07/30,2007/07/30,女,60-64,台南市,東區,大福里,台南市,東區,,否,中華民國,1
2007/07/13,2007/07/23,2007/07/20,女,20-24,台南市,東區,大福里,台南市,東區,,否,中華民國,1
2007/07/13,2007/07/24,2007/07/24,男,50-54,高雄市,三民區,千歲里,高雄市,三民區,,否,中華民國,1
2007/07/13,2007/07/30,2007/07/30,女,10-14,台南市,東區,大福里,台南市,東區,,否,中華民國,1
2007/07/13,2007/08/01,2007/07/17,男,45-49,台南市,安南區,安和里,台南市,安南區,,否,中華民國,1
2007/07/13,2007/07/18,2007/07/16,男,25-29,台南市,北區,成德里,台南市,北區,,否,中華民國,1
2007/07/13,2007/07/24,2007/07/24,男,35-39,台南市,東區,大福里,台南市,東區,,否,中華民國,1
2007/07/14,2007/07/26,2007/07/25,男,60-64,台南市,北區,玉皇里,台南市,北區,,否,中華民國,1
2007/07/14,2007/07/27,2007/07/27,女,55-59,台南市,安南區,安和里,台南市,安南區,,否,中華民國,1
2007/07/16,2007/10/24,2007/07/20,女,25-29,台南市,北區,玉皇里,台南市,北區,,否,中華民國,1
2007/07/16,2007/07/31,2007/07/31,女,50-54,高雄市,三民區,千歲里,高雄市,三民區,,否,中華民國,1
2007/07/16,2007/08/02,2007/07/23,男,65-69,雲林縣,虎尾鎮,中山里,,,,是,緬甸,1
2007/07/27,2007/08/17,2007/07/31,男,25-29,台南市,東區,忠孝里,台南市,東區,,否,中華民國,1
2007/07/27,2007/07/30,2007/07/30,女,25-29,高雄市,鼓山區,裕豐里,高雄市,三民區,,否,中華民國,1
2007/07/27,2007/08/06,2007/08/06,男,5-9,高雄市,左營區,新上里,高雄市,三民區,,否,中華民國,1
2007/07/27,2007/08/09,2007/08/09,女,55-59,台南市,南區,大忠里,台南市,南區,,否,中華民國,1
2007/07/27,2007/08/15,2007/08/02,女,55-59,高雄市,鳳山區,南成里,高雄市,鳳山區,,否,中華民國,1
2007/07/27,2007/08/15,2007/08/15,女,40-44,高雄市,前金區,新生里,高雄市,前金區,,否,中華民國,1
2007/08/01,2007/08/06,2007/08/04,女,55-59,高雄市,三民區,千歲里,高雄市,三民區,,否,中華民國,1
2007/08/01,2007/08/06,2007/08/04,女,60-64,台南市,南區,大林里,台南市,南區,,否,中華民國,1
2007/08/01,2007/08/08,2007/08/05,女,45-49,台南市,東區,大福里,台南市,東區,,否,中華民國,1
2007/08/01,2007/08/09,2007/08/07,女,10-14,高雄市,鼓山區,山下里,高雄市,三民區,,否,中華民國,1
2007/08/04,2007/08/11,2007/08/09,女,5-9,台南市,南區,大忠里,台南市,南區,,否,中華民國,1
2007/08/04,2007/08/11,2007/08/09,女,60-64,台南市,南區,大忠里,台南市,南區,,否,中華民國,1
2007/08/04,2007/08/09,2007/08/09,男,25-29,台南市,南區,大忠里,台南市,南區,,否,中華民國,1
2007/08/04,2007/08/10,2007/08/08,女,15-19,台南市,北區,國姓里,台南市,北區,,否,中華民國,1
2007/08/06,2007/08/12,2007/08/10,男,65-69,台南市,東區,崇明里,台南市,東區,,否,中華民國,1
2007/08/06,2007/08/13,2007/08/10,男,55-59,台北市,士林區,,,,,是,菲律賓,1
2007/08/06,2007/08/15,2007/08/11,女,55-59,台南市,東區,崇明里,台南市,東區,,否,中華民國,1
2007/08/06,2007/08/16,2007/08/13,男,10-14,台南市,北區,六甲里,台南市,北區,,否,中華民國,1
2007/08/07,2007/08/10,2007/08/10,男,55-59,台南市,東區,大福里,台南市,東區,,否,中華民國,1
2007/08/07,2007/09/01,2007/08/14,男,70+,台南市,北區,六甲里,台南市,北區,,否,中華民國,1
2007/08/09,2007/08/18,2007/08/16,男,40-44,台南市,南區,府南里,台南市,南區,,否,中華民國,1
2007/08/09,2007/08/24,2007/08/13,男,5-9,台南市,南區,大恩里,台南市,南區,,否,中華民國,1
2007/08/09,2007/08/15,2007/08/13,女,25-29,台南市,東區,忠孝里,台南市,東區,,否,中華民國,1
2007/08/10,2007/08/15,2007/08/13,男,20-24,台南市,北區,玉皇里,台南市,北區,,否,中華民國,1
2007/08/10,2007/08/18,2007/08/15,女,40-44,台南市,南區,大忠里,台南市,南區,,否,中華民國,1
2007/08/10,2007/08/30,2007/08/16,男,35-39,台南市,北區,大港里,台南市,北區,,否,中華民國,1
2007/08/10,2007/08/15,2007/08/11,男,55-59,台南市,東區,德光里,台南市,東區,,否,中華民國,1
2007/08/10,2007/09/01,2007/09/01,男,45-49,台南市,南區,永寧里,台南市,東區,,否,中華民國,1
2007/08/10,2007/08/17,2007/08/15,男,20-24,高雄市,三民區,千歲里,高雄市,三民區,,否,中華民國,1
2007/08/10,2007/08/18,2007/08/18,男,70+,台南市,東區,忠孝里,台南市,東區,,否,中華民國,1
2007/08/12,2007/08/15,2007/08/13,女,15-19,台南市,東區,大福里,台南市,東區,,否,中華民國,1
2007/08/15,2007/08/19,2007/08/15,男,70+,台南市,東區,忠孝里,台南市,東區,,否,中華民國,1
2007/08/15,2007/08/27,2007/08/27,男,70+,台南市,東區,忠孝里,台南市,東區,,否,中華民國,1
2007/08/15,2007/09/01,2007/09/01,男,70+,台南市,東區,忠孝里,台南市,東區,,否,中華民國,1
2007/08/15,2007/09/02,2007/08/21,男,60-64,台南市,中西區,大南里,台南市,中西區,,否,中華民國,1
2007/08/15,2007/09/12,2007/08/20,男,50-54,台南市,東區,忠孝里,台南市,東區,,否,中華民國,1
2007/08/16,2007/08/18,2007/08/18,男,70+,台南市,東區,忠孝里,台南市,東區,,否,中華民國,1
2007/08/16,2007/08/18,2007/08/18,男,70+,台南市,東區,忠孝里,台南市,東區,,否,中華民國,1
2007/08/16,2007/08/18,2007/08/18,男,70+,台南市,東區,忠孝里,台南市,東區,,否,中華民國,1
2007/08/16,2007/08/18,2007/08/18,男,70+,台南市,東區,忠孝里,台南市,東區,,否,中華民國,1
2007/08/16,2007/08/18,2007/08/18,男,70+,台南市,東區,忠孝里,台南市,東區,,否,中華民國,1
2007/08/16,2007/08/19,2007/08/17,男,70+,台南市,東區,忠孝里,台南市,東區,,否,中華民國,1
2007/08/16,2007/08/18,2007/08/18,男,70+,台南市,仁德區,成功里,台南市,東區,,否,中華民國,1
2007/08/16,2007/08/18,2007/08/18,男,70+,台南市,東區,忠孝里,台南市,東區,,否,中華民國,1
2007/08/16,2007/08/18,2007/08/18,男,70+,台南市,東區,忠孝里,台南市,東區,,否,中華民國,1
2007/08/17,2007/08/21,2007/08/18,男,70+,台南市,東區,忠孝里,台南市,東區,,否,中華民國,1
2007/08/17,2007/08/31,2007/08/23,男,70+,台南市,東區,忠孝里,台南市,東區,,否,中華民國,1
2007/08/17,2007/08/19,2007/08/17,男,70+,台南市,東區,忠孝里,台南市,東區,,否,中華民國,1
2007/08/17,2007/08/21,2007/08/18,男,70+,台南市,東區,忠孝里,台南市,東區,,否,中華民國,1
2007/08/17,2007/08/27,2007/08/27,男,40-44,台南市,東區,南聖里,台南市,東區,,否,中華民國,1
2007/08/17,2007/09/09,2007/08/22,女,35-39,台南市,東區,崇明里,台南市,東區,,否,中華民國,1
2007/08/17,2007/08/19,2007/08/17,男,70+,台南市,東區,忠孝里,台南市,東區,,否,中華民國,1
2007/08/17,2007/08/20,2007/08/18,男,70+,台南市,東區,忠孝里,台南市,東區,,否,中華民國,1
2007/08/17,2007/08/21,2007/08/18,男,70+,台南市,東區,忠孝里,台南市,東區,,否,中華民國,1
2007/08/17,2007/08/21,2007/08/18,男,70+,台南市,東區,忠孝里,台南市,東區,,否,中華民國,1
2007/08/17,2007/09/06,2007/08/22,女,70+,台南市,南區,新生里,台南市,南區,,否,中華民國,1
2007/08/17,2007/09/08,2007/08/22,男,70+,台南市,東區,忠孝里,台南市,東區,,否,中華民國,1
2007/08/19,2007/09/04,2007/08/19,男,70+,台南市,東區,忠孝里,台南市,東區,,否,中華民國,1
2007/08/19,2007/08/21,2007/08/19,男,70+,台南市,東區,忠孝里,台南市,東區,,否,中華民國,1
2007/08/19,2007/08/23,2007/08/20,男,70+,台南市,東區,忠孝里,台南市,東區,,否,中華民國,1
2007/08/19,2007/09/12,2007/08/23,男,65-69,台南市,東區,崇信里,台南市,東區,,否,中華民國,1
2007/08/19,2007/08/21,2007/08/19,男,70+,台南市,東區,忠孝里,台南市,東區,,否,中華民國,1
2007/08/20,2007/08/23,2007/08/21,男,70+,台南市,東區,忠孝里,台南市,東區,,否,中華民國,1
2007/08/20,2007/08/31,2007/08/31,男,20-24,台南市,南區,大忠里,台南市,南區,,否,中華民國,1
2007/08/20,2007/09/07,2007/08/25,男,45-49,桃園市,蘆竹區,羊稠里,,,,是,越南,1
2007/08/20,2007/09/01,2007/09/01,男,70+,台南市,東區,忠孝里,台南市,東區,,否,中華民國,1
2007/08/22,2007/08/27,2007/08/27,男,5-9,新北市,三重區,,,,,是,柬埔寨,1
2007/09/06,2007/09/19,2007/09/11,男,35-39,台南市,北區,玉皇里,台南市,北區,,否,中華民國,1
2007/09/04,2007/09/08,2007/09/05,男,20-24,台南市,北區,國姓里,台南市,北區,,否,中華民國,1
2007/09/04,2007/09/12,2007/09/10,男,25-29,台南市,東區,裕農里,台南市,東區,,否,中華民國,1
2007/09/05,2007/09/11,2007/09/09,男,5-9,台南市,北區,正覺里,台南市,北區,,否,中華民國,1
2007/09/06,2007/09/13,2007/09/10,女,40-44,台南市,東區,裕農里,台南市,東區,,否,中華民國,1
2007/09/06,2007/09/13,2007/09/10,男,70+,台南市,東區,東光里,台南市,東區,,否,中華民國,1
2007/09/07,2007/09/13,2007/09/10,女,40-44,台南市,東區,崇信里,台南市,東區,,否,中華民國,1
2007/09/07,2007/09/13,2007/09/10,男,50-54,台南市,東區,裕農里,台南市,東區,,否,中華民國,1
2007/09/08,2007/09/19,2007/09/17,男,65-69,台南市,東區,裕農里,台南市,東區,,否,中華民國,1
2007/09/08,2007/09/19,2007/09/15,男,5-9,台南市,東區,裕農里,台南市,東區,,否,中華民國,1
2007/09/09,2007/09/15,2007/09/12,女,45-49,台南市,東區,裕農里,台南市,東區,,否,中華民國,1
2007/09/09,2007/09/16,2007/09/13,女,50-54,台南市,東區,裕農里,台南市,東區,,否,中華民國,1
2007/09/10,2007/10/04,2007/09/17,男,45-49,台南市,東區,裕農里,台南市,東區,,否,中華民國,1
2007/09/10,2007/09/15,2007/09/11,女,15-19,台南市,南區,府南里,台南市,南區,,否,中華民國,1
2007/09/12,2007/09/16,2007/09/16,女,70+,台南市,北區,興南里,台南市,北區,,否,中華民國,1
2007/09/12,2007/09/19,2007/09/17,女,55-59,台南市,東區,大德里,台南市,東區,,否,中華民國,1
2007/09/12,2007/09/20,2007/09/17,男,30-34,台南市,南區,國宅里,台南市,南區,,否,中華民國,1
2007/09/12,2007/09/19,2007/09/17,男,65-69,台南市,安南區,安富里,台南市,安南區,,否,中華民國,1
2007/09/12,2007/09/20,2007/09/17,男,35-39,台南市,北區,興北里,台南市,北區,,否,中華民國,1
2007/09/13,2007/09/20,2007/09/17,男,55-59,台南市,東區,忠孝里,台南市,東區,,否,中華民國,1
2007/09/13,2007/09/19,2007/09/15,男,65-69,台南市,北區,興北里,台南市,北區,,否,中華民國,1
2007/09/13,2007/11/03,2007/11/03,男,65-69,台南市,關廟區,深坑里,台南市,關廟區,,否,中華民國,1
2007/09/13,2007/10/04,2007/09/17,女,5-9,台南市,北區,成德里,台南市,北區,,否,中華民國,1
2007/09/15,2007/09/23,2007/09/20,女,40-44,台南市,東區,大智里,台南市,東區,,否,中華民國,1
2007/09/15,2007/10/29,2007/09/22,女,15-19,台南市,中西區,永福里,台南市,中西區,,否,中華民國,1
2007/09/15,2007/09/20,2007/09/17,女,10-14,台南市,北區,成德里,台南市,北區,,否,中華民國,1
2007/09/17,2007/09/26,2007/09/26,男,25-29,台南市,東區,裕農里,台南市,東區,,否,中華民國,1
2007/09/17,2007/09/20,2007/09/18,女,40-44,台南市,北區,公園里,台南市,北區,,否,中華民國,1
2007/09/17,2007/09/26,2007/09/24,女,50-54,台南市,北區,興北里,台南市,北區,,否,中華民國,1
2007/09/18,2007/10/03,2007/09/24,女,35-39,台南市,南區,府南里,台南市,南區,,否,中華民國,1
2007/09/21,2007/10/06,2007/09/28,女,30-34,台南市,北區,正覺里,台南市,北區,,否,中華民國,1
2007/09/21,2007/09/25,2007/09/25,男,45-49,台南市,東區,裕農里,台南市,東區,,否,中華民國,1
2007/09/21,2007/09/26,2007/09/24,女,20-24,台南市,北區,興北里,台南市,北區,,否,中華民國,1
2007/09/21,2007/09/29,2007/09/26,男,15-19,台南市,南區,文南里,台南市,南區,,否,中華民國,1
2007/09/21,2007/09/29,2007/09/26,男,65-69,台南市,東區,大同里,台南市,東區,,否,中華民國,1
2007/09/21,2007/10/19,2007/09/24,女,5-9,台南市,中西區,文賢里,台南市,北區,,否,中華民國,1
2007/09/21,2007/09/27,2007/09/24,女,60-64,台南市,東區,大同里,台南市,南區,,否,中華民國,1
2007/09/21,2007/09/24,2007/09/24,男,45-49,台南市,南區,田寮里,台南市,南區,,否,中華民國,1
2007/09/23,2007/10/02,2007/10/01,女,55-59,台南市,北區,玉皇里,台南市,北區,,否,中華民國,1
2007/09/23,2007/10/14,2007/10/14,男,15-19,台南市,東區,泉南里,台南市,東區,泉南里,否,中華民國,1
2007/09/23,2007/09/27,2007/09/24,女,25-29,台南市,東區,裕農里,台南市,東區,,否,中華民國,1
2007/10/01,2007/10/04,2007/10/02,女,65-69,台南市,東區,崇誨里,台南市,東區,,否,中華民國,1
2007/10/01,2007/10/06,2007/10/04,男,15-19,台南市,中西區,水仙里,台南市,中西區,,否,中華民國,1
2007/10/01,2007/10/10,2007/10/06,男,30-34,台南市,東區,富強里,台南市,東區,,否,中華民國,1
2007/10/01,2007/10/19,2007/10/09,女,45-49,台南市,永康區,中興里,台南市,東區,,否,中華民國,1
2007/10/01,2007/10/31,2007/10/05,男,50-54,台南市,南區,大林里,台南市,南區,,否,中華民國,1
2007/10/01,2007/11/01,2007/10/08,男,40-44,台南市,北區,玉皇里,台南市,北區,玉皇里,否,中華民國,1
2007/10/03,2007/10/10,2007/10/06,女,45-49,台南市,中西區,水仙里,台南市,中西區,,否,中華民國,1
2007/10/03,2007/10/10,2007/10/07,男,40-44,台南市,永康區,勝利里,台南市,安南區,,否,中華民國,1
2007/10/04,2007/10/25,2007/10/09,男,35-39,台南市,北區,光武里,台南市,北區,,否,中華民國,1
2007/10/06,2007/10/12,2007/10/09,女,15-19,台南市,中西區,大南里,台南市,中西區,大南里,否,中華民國,1
2007/10/06,2007/10/12,2007/10/09,男,70+,台南市,東區,東明里,台南市,東區,東明里,否,中華民國,1
2007/10/06,2007/10/13,2007/10/10,女,25-29,台南市,北區,永祥里,台南市,北區,永祥里,否,中華民國,1
2007/10/06,2007/10/14,2007/10/12,男,50-54,台南市,中西區,西湖里,,,,是,越南,1
2007/10/06,2007/10/15,2007/10/12,女,45-49,台南市,東區,東聖里,台南市,東區,東聖里,否,中華民國,1
2007/10/06,2007/10/15,2007/10/12,男,65-69,台南市,東區,新東里,台南市,東區,新東里,否,中華民國,1
2007/10/06,2007/11/14,2007/11/12,男,20-24,台南市,東區,大同里,台南市,東區,大同里,否,中華民國,1
2007/10/06,2007/10/13,2007/10/10,男,50-54,台南市,中西區,萬昌里,台南市,中西區,萬昌里,否,中華民國,1
2007/10/06,2007/10/23,2007/10/13,女,40-44,高雄市,路竹區,竹東里,高雄市,路竹區,,否,中華民國,1
2007/10/06,2007/10/25,2007/10/08,男,50-54,台南市,北區,大和里,台南市,北區,大和里,否,中華民國,1
2007/10/06,2007/10/26,2007/10/11,男,65-69,台南市,歸仁區,許厝里,台南市,歸仁區,,否,中華民國,1
2007/10/06,2007/10/25,2007/10/11,男,25-29,台南市,北區,大豐里,台南市,北區,大豐里,否,中華民國,1
2007/10/06,2007/10/26,2007/10/15,男,40-44,彰化縣,彰化市,五權里,,,,是,越南,1
2007/10/07,2007/10/23,2007/10/11,女,25-29,台南市,南區,府南里,台南市,南區,府南里,否,中華民國,1
2007/10/07,2007/10/25,2007/10/12,男,20-24,台南市,永康區,勝利里,台南市,東區,,否,中華民國,1
2007/10/07,2007/10/10,2007/10/08,男,35-39,台南市,中西區,普濟里,台南市,中西區,,否,中華民國,1
2007/10/07,2007/10/11,2007/10/11,女,30-34,新竹縣,新豐鄉,中崙村,,,,是,菲律賓,1
2007/10/07,2007/10/15,2007/10/13,女,50-54,台南市,永康區,龍潭里,台南市,北區,,否,中華民國,1
2007/10/08,2007/10/13,2007/10/11,男,15-19,台南市,北區,六甲里,台南市,北區,六甲里,否,中華民國,1
2007/10/08,2007/10/17,2007/10/15,男,70+,台南市,東區,大福里,台南市,東區,大福里,否,中華民國,1
2007/10/08,2007/10/12,2007/10/11,女,60-64,台南市,中西區,萬昌里,台南市,中西區,萬昌里,否,中華民國,1
2007/10/08,2007/10/16,2007/10/13,男,55-59,台北市,南港區,西新里,,,,是,越南,1
2007/10/08,2007/10/22,2007/10/22,女,70+,台南市,歸仁區,許厝里,台南市,歸仁區,許厝里,否,中華民國,1
2007/10/08,2007/11/01,2007/11/01,女,70+,台南市,關廟區,山西里,台南市,關廟區,,否,中華民國,1
2007/10/08,2007/10/13,2007/10/10,女,65-69,台南市,東區,東明里,台南市,東區,,否,中華民國,1
2007/10/12,2007/10/15,2007/10/15,女,40-44,台南市,北區,延平里,台南市,北區,延平里,否,中華民國,1
2007/10/12,2007/10/17,2007/10/15,男,55-59,台南市,東區,泉南里,台南市,東區,泉南里,否,中華民國,1
2007/10/12,2007/10/17,2007/10/15,女,65-69,台南市,歸仁區,許厝里,台南市,歸仁區,許厝里,否,中華民國,1
2007/10/12,2007/10/19,2007/10/17,男,40-44,台南市,仁德區,一甲里,,,,否,中華民國,1
2007/10/12,2007/10/19,2007/10/17,男,30-34,台南市,東區,富裕里,台南市,東區,富裕里,否,中華民國,1
2007/10/12,2007/10/19,2007/10/18,男,60-64,台南市,東區,富強里,台南市,東區,富強里,否,中華民國,1
2007/10/12,2007/10/19,2007/10/18,女,55-59,台南市,南區,新生里,台南市,南區,新生里,否,中華民國,1
2007/10/12,2007/10/20,2007/10/17,女,25-29,台南市,東區,自強里,台南市,東區,自強里,否,中華民國,1
2007/10/13,2007/10/18,2007/10/16,男,35-39,台南市,永康區,復國里,台南市,北區,,否,中華民國,1
2007/10/14,2007/10/19,2007/10/17,女,35-39,台南市,中西區,赤嵌里,台南市,中西區,赤嵌里,否,中華民國,1
2007/10/14,2007/10/24,2007/10/23,男,60-64,台南市,北區,大豐里,台南市,北區,大豐里,否,中華民國,1
2007/10/14,2007/10/30,2007/10/19,男,35-39,台南市,西港區,南海里,台南市,北區,,否,中華民國,1
2007/10/14,2007/11/02,2007/10/21,女,35-39,台南市,北區,延平里,台南市,北區,延平里,否,中華民國,1
2007/10/15,2007/10/20,2007/10/18,女,65-69,台南市,永康區,勝利里,台南市,東區,,否,中華民國,1
2007/10/15,2007/10/21,2007/10/18,男,15-19,台南市,中西區,仙草里,台南市,中西區,仙草里,否,中華民國,1